Information card for entry 7246612
Formula | C20 H12 N O8 Zn2 |
Calculated formula | C20 H12 N O8 Zn2 |
Title of publication | Four Zn(ii)-5-(2-carboxy-phenoxy)-1,3-benzenedicarboxylate coordination polymers induced by different N-ligands: synthesis, structure, and fluorescence detection for BPA and IMH |
Authors of publication | Zhang, Kena; Wang, Qiushuang; Gong, Yuanyuan; Wang, Nairong; Li, Xia |
Journal of publication | CrystEngComm |
Year of publication | 2023 |
Journal volume | 25 |
Journal issue | 20 |
Pages of publication | 3033 - 3043 |
a | 9.3209 ± 0.0004 Å |
b | 9.6054 ± 0.0004 Å |
c | 10.9253 ± 0.0005 Å |
α | 97.395 ± 0.001° |
β | 92.419 ± 0.001° |
γ | 103.814 ± 0.001° |
Cell volume | 939.25 ± 0.07 Å3 |
Cell temperature | 293 ± 2 K |
Ambient diffraction temperature | 293 ± 2 K |
Number of distinct elements | 5 |
Space group number | 2 |
Hermann-Mauguin space group symbol | P -1 |
Hall space group symbol | -P 1 |
Residual factor for all reflections | 0.0402 |
Residual factor for significantly intense reflections | 0.0372 |
Weighted residual factors for significantly intense reflections | 0.0982 |
Weighted residual factors for all reflections included in the refinement | 0.101 |
Goodness-of-fit parameter for all reflections included in the refinement | 1.047 |
Diffraction radiation wavelength | 0.71073 Å |
Diffraction radiation type | MoKα |