Information card for entry 7246613
Formula | C56 H44 N4 O15 Zn3 |
Calculated formula | C56 H44 N4 O15 Zn3 |
Title of publication | Four Zn(ii)-5-(2-carboxy-phenoxy)-1,3-benzenedicarboxylate coordination polymers induced by different N-ligands: synthesis, structure, and fluorescence detection for BPA and IMH |
Authors of publication | Zhang, Kena; Wang, Qiushuang; Gong, Yuanyuan; Wang, Nairong; Li, Xia |
Journal of publication | CrystEngComm |
Year of publication | 2023 |
Journal volume | 25 |
Journal issue | 20 |
Pages of publication | 3033 - 3043 |
a | 15.4865 ± 0.0006 Å |
b | 7.7516 ± 0.0003 Å |
c | 21.7882 ± 0.0009 Å |
α | 90° |
β | 107.48 ± 0.001° |
γ | 90° |
Cell volume | 2494.79 ± 0.17 Å3 |
Cell temperature | 293 ± 2 K |
Ambient diffraction temperature | 293 ± 2 K |
Number of distinct elements | 5 |
Space group number | 13 |
Hermann-Mauguin space group symbol | P 1 2/c 1 |
Hall space group symbol | -P 2yc |
Residual factor for all reflections | 0.048 |
Residual factor for significantly intense reflections | 0.0429 |
Weighted residual factors for significantly intense reflections | 0.1154 |
Weighted residual factors for all reflections included in the refinement | 0.12 |
Goodness-of-fit parameter for all reflections included in the refinement | 1.085 |
Diffraction radiation wavelength | 0.71073 Å |
Diffraction radiation type | MoKα |