Information card for entry 7246673
Formula | C3 H4 Ag N S2 |
Calculated formula | C3 H4 Ag N S2 |
Title of publication | Selective synthesis of two-dimensional semiconductive coordination polymers with silver–sulfur network |
Authors of publication | Akiyoshi, Ryohei; Saeki, Akinori; Ogasawara, Kazuyoshi; Yoshikawa, Hirofumi; Nakamura, Yuiga; Tanaka, Daisuke |
Journal of publication | CrystEngComm |
Year of publication | 2023 |
Journal volume | 25 |
Journal issue | 20 |
Pages of publication | 2990 - 2994 |
a | 11.1792 ± 0.0003 Å |
b | 6.3833 ± 0.0001 Å |
c | 7.9535 ± 0.0002 Å |
α | 90° |
β | 104.23 ± 0.003° |
γ | 90° |
Cell volume | 550.15 ± 0.02 Å3 |
Cell temperature | 100 K |
Ambient diffraction temperature | 100 K |
Number of distinct elements | 5 |
Space group number | 14 |
Hermann-Mauguin space group symbol | P 1 21/c 1 |
Hall space group symbol | -P 2ybc |
Residual factor for all reflections | 0.0495 |
Residual factor for significantly intense reflections | 0.0487 |
Weighted residual factors for significantly intense reflections | 0.1439 |
Weighted residual factors for all reflections included in the refinement | 0.1451 |
Goodness-of-fit parameter for all reflections included in the refinement | 1.101 |
Diffraction radiation probe | x-ray |
Diffraction radiation wavelength | 0.4156 Å |
Diffraction radiation type | synchrotron |