Information card for entry 7246674
Formula | C5 H4 Ag2 F3 N O2 S2 |
Calculated formula | C5 H4 Ag2 F3 N O2 S2 |
Title of publication | Selective synthesis of two-dimensional semiconductive coordination polymers with silver–sulfur network |
Authors of publication | Akiyoshi, Ryohei; Saeki, Akinori; Ogasawara, Kazuyoshi; Yoshikawa, Hirofumi; Nakamura, Yuiga; Tanaka, Daisuke |
Journal of publication | CrystEngComm |
Year of publication | 2023 |
Journal volume | 25 |
Journal issue | 20 |
Pages of publication | 2990 - 2994 |
a | 12.4028 ± 0.0003 Å |
b | 10.0914 ± 0.0003 Å |
c | 7.3468 ± 0.0002 Å |
α | 90° |
β | 91.801 ± 0.002° |
γ | 90° |
Cell volume | 919.08 ± 0.04 Å3 |
Cell temperature | 150 K |
Ambient diffraction temperature | 150 K |
Number of distinct elements | 7 |
Space group number | 14 |
Hermann-Mauguin space group symbol | P 1 21/c 1 |
Hall space group symbol | -P 2ybc |
Residual factor for all reflections | 0.0463 |
Residual factor for significantly intense reflections | 0.0357 |
Weighted residual factors for significantly intense reflections | 0.0866 |
Weighted residual factors for all reflections included in the refinement | 0.0918 |
Goodness-of-fit parameter for all reflections included in the refinement | 1.031 |
Diffraction radiation probe | x-ray |
Diffraction radiation wavelength | 0.71073 Å |
Diffraction radiation type | MoKα |