Information card for entry 7246686
Chemical name | 2,4-difluoro-6-nitrobenzene-1,3-diamine 18-crown-6 1:1 cocrystal |
Formula | C18 H29 F2 N3 O8 |
Calculated formula | C18 H29 F2 N3 O8 |
Title of publication | How does the combination of the nitro group and fluorine atoms affect the (co)crystallization behaviour of arylenediamines? |
Authors of publication | Vaganova, Tamara A.; Gatilov, Yurij V.; Kryuchkova, Natalia A.; Pishchur, Denis P.; Zhukovets, Anastasia A.; Malykhin, Evgenij V. |
Journal of publication | CrystEngComm |
Year of publication | 2023 |
Journal volume | 25 |
Journal issue | 22 |
Pages of publication | 3284 - 3298 |
a | 7.9046 ± 0.0008 Å |
b | 9.2505 ± 0.0008 Å |
c | 15.7606 ± 0.0016 Å |
α | 79.769 ± 0.003° |
β | 84.623 ± 0.003° |
γ | 78.313 ± 0.004° |
Cell volume | 1108.61 ± 0.19 Å3 |
Cell temperature | 296 ± 2 K |
Ambient diffraction temperature | 296 ± 2 K |
Number of distinct elements | 5 |
Space group number | 2 |
Hermann-Mauguin space group symbol | P -1 |
Hall space group symbol | -P 1 |
Residual factor for all reflections | 0.082 |
Residual factor for significantly intense reflections | 0.0636 |
Weighted residual factors for significantly intense reflections | 0.1754 |
Weighted residual factors for all reflections included in the refinement | 0.1991 |
Goodness-of-fit parameter for all reflections included in the refinement | 1.027 |
Diffraction radiation wavelength | 0.71073 Å |
Diffraction radiation type | MoKα |