Information card for entry 7246687
Chemical name | 2,4,5-trifluoro-6-nitrobenzene-1,3-diamine |
Formula | C6 H4 F3 N3 O2 |
Calculated formula | C6 H4 F3 N3 O2 |
SMILES | Fc1c(N)c(N(=O)=O)c(F)c(F)c1N |
Title of publication | How does the combination of the nitro group and fluorine atoms affect the (co)crystallization behaviour of arylenediamines? |
Authors of publication | Vaganova, Tamara A.; Gatilov, Yurij V.; Kryuchkova, Natalia A.; Pishchur, Denis P.; Zhukovets, Anastasia A.; Malykhin, Evgenij V. |
Journal of publication | CrystEngComm |
Year of publication | 2023 |
Journal volume | 25 |
Journal issue | 22 |
Pages of publication | 3284 - 3298 |
a | 7.1452 ± 0.0004 Å |
b | 13.566 ± 0.0008 Å |
c | 7.7555 ± 0.0005 Å |
α | 90° |
β | 90° |
γ | 90° |
Cell volume | 751.75 ± 0.08 Å3 |
Cell temperature | 296 ± 2 K |
Ambient diffraction temperature | 296 ± 2 K |
Number of distinct elements | 5 |
Space group number | 33 |
Hermann-Mauguin space group symbol | P n a 21 |
Hall space group symbol | P 2c -2n |
Residual factor for all reflections | 0.0421 |
Residual factor for significantly intense reflections | 0.033 |
Weighted residual factors for significantly intense reflections | 0.096 |
Weighted residual factors for all reflections included in the refinement | 0.1053 |
Goodness-of-fit parameter for all reflections included in the refinement | 1.047 |
Diffraction radiation wavelength | 0.71073 Å |
Diffraction radiation type | MoKα |