Information card for entry 7246794
Chemical name |
Strontium Dialuminate - Ht |
Formula |
Al2 O4 Sr |
Calculated formula |
Al2 O6 Sr |
Title of publication |
The proton conduction behavior of two 1D open-framework metal phosphates with similar crystal structures and different hydrogen bond networks |
Authors of publication |
Zhang, Kai-ming; Ji, Min-fang; Zhou, Xue-Yi; Xuan, Fang; Duan, Bo-yuan; Yuan, Yuan; Liu, Guang-xiang; Duan, Hai-bao; Zhao, Hai-rong |
Journal of publication |
RSC Advances |
Year of publication |
2023 |
Journal volume |
13 |
Journal issue |
19 |
Pages of publication |
12703 - 12711 |
a |
5.1765 Å |
b |
5.1765 Å |
c |
8.5758 Å |
α |
90° |
β |
90° |
γ |
120° |
Cell volume |
199.011 Å3 |
Number of distinct elements |
3 |
Space group number |
182 |
Hermann-Mauguin space group symbol |
P 63 2 2 |
Hall space group symbol |
P 6c 2c |
Residual factor for all reflections |
0.0238 |
Yes |
No |
No |