Information card for entry 7246795
Chemical name |
Thulium Magnesium (5/24) |
Formula |
Mg24 Tm5 |
Calculated formula |
Mg24 Tm5 |
Title of publication |
The proton conduction behavior of two 1D open-framework metal phosphates with similar crystal structures and different hydrogen bond networks |
Authors of publication |
Zhang, Kai-ming; Ji, Min-fang; Zhou, Xue-Yi; Xuan, Fang; Duan, Bo-yuan; Yuan, Yuan; Liu, Guang-xiang; Duan, Hai-bao; Zhao, Hai-rong |
Journal of publication |
RSC Advances |
Year of publication |
2023 |
Journal volume |
13 |
Journal issue |
19 |
Pages of publication |
12703 - 12711 |
a |
11.215 Å |
b |
11.215 Å |
c |
11.215 Å |
α |
90° |
β |
90° |
γ |
90° |
Cell volume |
1410.58 Å3 |
Number of distinct elements |
2 |
Space group number |
217 |
Hermann-Mauguin space group symbol |
I -4 3 m |
Hall space group symbol |
I -4 2 3 |
Yes |
No |
No |