Information card for entry 7246817
Formula | C24 H48 B2 F8 Fe0.65 N24 Ru0.35 |
Calculated formula | C24 H48 B2 F8 Fe0.65 N24 Ru0.35 |
Title of publication | Ferroelastic phase transition and the role of volume strain in the structural trapping of a metastable quenched low-spin high-symmetry phase in [Ru0.35Fe0.65(ptz)6](BF4)2 |
Authors of publication | Valverde-Muñoz, Francisco Javier; Torres Ramírez, Ricardo Guillermo; Ulhe, Abhilash; Trzop, Elzbieta; Dutta, Mousumi; Das, Chinmoy; Chakraborty, Pradip; Collet, Eric |
Journal of publication | CrystEngComm |
Year of publication | 2023 |
Journal volume | 25 |
Journal issue | 25 |
Pages of publication | 3588 - 3597 |
a | 10.7307 ± 0.0002 Å |
b | 10.7307 ± 0.0002 Å |
c | 31.9228 ± 0.0009 Å |
α | 90° |
β | 90° |
γ | 120° |
Cell volume | 3183.37 ± 0.12 Å3 |
Cell temperature | 80.4 ± 0.12 K |
Ambient diffraction temperature | 80.4 ± 0.12 K |
Number of distinct elements | 7 |
Space group number | 148 |
Hermann-Mauguin space group symbol | R -3 :H |
Hall space group symbol | -R 3 |
Residual factor for all reflections | 0.0333 |
Residual factor for significantly intense reflections | 0.0302 |
Weighted residual factors for significantly intense reflections | 0.0594 |
Weighted residual factors for all reflections included in the refinement | 0.0604 |
Goodness-of-fit parameter for all reflections included in the refinement | 1.135 |
Diffraction radiation probe | x-ray |
Diffraction radiation wavelength | 0.71073 Å |
Diffraction radiation type | MoKα |