Information card for entry 7246818
Formula | C24 H48 B2 F8 Fe0.65 N24 Ru0.35 |
Calculated formula | C24 H48 B2 F8 Fe0.65 N24 Ru0.35 |
Title of publication | Ferroelastic phase transition and the role of volume strain in the structural trapping of a metastable quenched low-spin high-symmetry phase in [Ru0.35Fe0.65(ptz)6](BF4)2 |
Authors of publication | Valverde-Muñoz, Francisco Javier; Torres Ramírez, Ricardo Guillermo; Ulhe, Abhilash; Trzop, Elzbieta; Dutta, Mousumi; Das, Chinmoy; Chakraborty, Pradip; Collet, Eric |
Journal of publication | CrystEngComm |
Year of publication | 2023 |
Journal volume | 25 |
Journal issue | 25 |
Pages of publication | 3588 - 3597 |
a | 11.7873 ± 0.0013 Å |
b | 10.8372 ± 0.0006 Å |
c | 21.595 ± 0.003 Å |
α | 90.927 ± 0.007° |
β | 131.808 ± 0.015° |
γ | 89.563 ± 0.007° |
Cell volume | 2055.9 ± 0.6 Å3 |
Cell temperature | 80.7 ± 0.7 K |
Ambient diffraction temperature | 80.7 ± 0.7 K |
Number of distinct elements | 7 |
Space group number | 2 |
Hermann-Mauguin space group symbol | P -1 |
Hall space group symbol | -P 1 |
Residual factor for all reflections | 0.1539 |
Residual factor for significantly intense reflections | 0.0753 |
Weighted residual factors for significantly intense reflections | 0.141 |
Weighted residual factors for all reflections included in the refinement | 0.1617 |
Goodness-of-fit parameter for all reflections included in the refinement | 0.903 |
Diffraction radiation probe | x-ray |
Diffraction radiation wavelength | 0.71073 Å |
Diffraction radiation type | MoKα |