Information card for entry 7246819
Formula | C36 H40 Cd3 N4 O31 |
Calculated formula | C36 H36 Cd3 N4 O31 |
Title of publication | A stable 2D luminescent metal–organic framework as a highly sensitive sensor for Fe3+ and Cr2O72−/CrO42− in water |
Authors of publication | Ning, Shigang; Yan, Bingcheng; Wu, Junrong; Chen, Sen; Chen, Weipeng; Tian, Hongju; Zhang, Shaowei |
Journal of publication | CrystEngComm |
Year of publication | 2023 |
Journal volume | 25 |
Journal issue | 24 |
Pages of publication | 3539 - 3547 |
a | 21.411 ± 0.002 Å |
b | 16.5319 ± 0.0015 Å |
c | 13.6853 ± 0.0013 Å |
α | 90° |
β | 105.095 ± 0.001° |
γ | 90° |
Cell volume | 4677 ± 0.8 Å3 |
Cell temperature | 296 ± 2 K |
Ambient diffraction temperature | 296.15 K |
Number of distinct elements | 5 |
Space group number | 15 |
Hermann-Mauguin space group symbol | C 1 2/c 1 |
Hall space group symbol | -C 2yc |
Residual factor for all reflections | 0.0575 |
Residual factor for significantly intense reflections | 0.0413 |
Weighted residual factors for significantly intense reflections | 0.1013 |
Weighted residual factors for all reflections included in the refinement | 0.1129 |
Goodness-of-fit parameter for all reflections included in the refinement | 1.026 |
Diffraction radiation wavelength | 0.71073 Å |
Diffraction radiation type | MoKα |