Information card for entry 7246837
Formula | C36 H69 N31 O49 Sm2 |
Calculated formula | C36 H68 N31 O49 Sm2 |
Title of publication | Supramolecular lanthanide assemblies with cucurbit[6]uril: from synthesis and crystal structure to application |
Authors of publication | Andrienko, Irina V.; Rakhmanova, Mariana I.; Samsonenko, Denis G.; Kovalenko, Ekaterina A. |
Journal of publication | CrystEngComm |
Year of publication | 2023 |
Journal volume | 25 |
Journal issue | 23 |
Pages of publication | 3460 - 3471 |
a | 14.3566 ± 0.0004 Å |
b | 13.5936 ± 0.0004 Å |
c | 18.0138 ± 0.0005 Å |
α | 90° |
β | 105.343 ± 0.003° |
γ | 90° |
Cell volume | 3390.24 ± 0.17 Å3 |
Cell temperature | 130 ± 2 K |
Ambient diffraction temperature | 130 ± 2 K |
Number of distinct elements | 5 |
Space group number | 14 |
Hermann-Mauguin space group symbol | P 1 21/n 1 |
Hall space group symbol | -P 2yn |
Residual factor for all reflections | 0.03 |
Residual factor for significantly intense reflections | 0.0247 |
Weighted residual factors for significantly intense reflections | 0.0569 |
Weighted residual factors for all reflections included in the refinement | 0.0591 |
Goodness-of-fit parameter for all reflections included in the refinement | 1.051 |
Diffraction radiation probe | x-ray |
Diffraction radiation wavelength | 0.71073 Å |
Diffraction radiation type | MoKα |