Information card for entry 7246838
Formula | C36 H69 Gd2 N31 O49 |
Calculated formula | C36 H68 Gd2 N31 O49 |
Title of publication | Supramolecular lanthanide assemblies with cucurbit[6]uril: from synthesis and crystal structure to application |
Authors of publication | Andrienko, Irina V.; Rakhmanova, Mariana I.; Samsonenko, Denis G.; Kovalenko, Ekaterina A. |
Journal of publication | CrystEngComm |
Year of publication | 2023 |
Journal volume | 25 |
Journal issue | 23 |
Pages of publication | 3460 - 3471 |
a | 14.36 ± 0.002 Å |
b | 13.586 ± 0.003 Å |
c | 17.933 ± 0.003 Å |
α | 90° |
β | 105.395 ± 0.002° |
γ | 90° |
Cell volume | 3373.1 ± 1 Å3 |
Cell temperature | 100 ± 2 K |
Ambient diffraction temperature | 100 ± 2 K |
Number of distinct elements | 5 |
Space group number | 14 |
Hermann-Mauguin space group symbol | P 1 21/n 1 |
Hall space group symbol | -P 2yn |
Residual factor for all reflections | 0.032 |
Residual factor for significantly intense reflections | 0.0312 |
Weighted residual factors for significantly intense reflections | 0.08 |
Weighted residual factors for all reflections included in the refinement | 0.0806 |
Goodness-of-fit parameter for all reflections included in the refinement | 1.042 |
Diffraction radiation wavelength | 0.745 Å |
Diffraction radiation type | synchrotron |