Information card for entry 7246869
Formula | C7 H10 Cl N5 O Se |
Calculated formula | C7 H10 Cl N5 O Se |
SMILES | [se]1nc([n+]2c1cccc2)N=C(N)N.[Cl-].O |
Title of publication | Mechanistic investigation of 1,3-dipolar cycloaddition between bifunctional 2-pyridylselenyl reagents and nitriles including reactions with cyanamides |
Authors of publication | Artemjev, Alexey A.; Kubasov, Alexey S.; Kuznetsov, Maxim L.; Grudova, Mariya V.; Khrustalev, Victor N.; Kritchenkov, Andreii S.; Tskhovrebov, Alexander G. |
Journal of publication | CrystEngComm |
Year of publication | 2023 |
Journal volume | 25 |
Journal issue | 25 |
Pages of publication | 3691 - 3701 |
a | 7.8986 ± 0.0015 Å |
b | 14.662 ± 0.004 Å |
c | 9.851 ± 0.004 Å |
α | 90° |
β | 111.161 ± 0.015° |
γ | 90° |
Cell volume | 1063.9 ± 0.6 Å3 |
Cell temperature | 100 K |
Ambient diffraction temperature | 100 K |
Number of distinct elements | 6 |
Space group number | 14 |
Hermann-Mauguin space group symbol | P 1 21/c 1 |
Hall space group symbol | -P 2ybc |
Residual factor for all reflections | 0.0455 |
Residual factor for significantly intense reflections | 0.0387 |
Weighted residual factors for significantly intense reflections | 0.1028 |
Weighted residual factors for all reflections included in the refinement | 0.1063 |
Goodness-of-fit parameter for all reflections included in the refinement | 1.053 |
Diffraction radiation wavelength | 0.71073 Å |
Diffraction radiation type | MoKα |