Information card for entry 7246870
Formula | C13 H12 Cl N3 O Se |
Calculated formula | C13 H12 Cl N3 O Se |
SMILES | [se]1nc([n+]2c1cccc2)Nc1ccc(OC)cc1.[Cl-] |
Title of publication | Mechanistic investigation of 1,3-dipolar cycloaddition between bifunctional 2-pyridylselenyl reagents and nitriles including reactions with cyanamides |
Authors of publication | Artemjev, Alexey A.; Kubasov, Alexey S.; Kuznetsov, Maxim L.; Grudova, Mariya V.; Khrustalev, Victor N.; Kritchenkov, Andreii S.; Tskhovrebov, Alexander G. |
Journal of publication | CrystEngComm |
Year of publication | 2023 |
Journal volume | 25 |
Journal issue | 25 |
Pages of publication | 3691 - 3701 |
a | 6.9994 ± 0.001 Å |
b | 8.8877 ± 0.001 Å |
c | 20.694 ± 0.005 Å |
α | 90° |
β | 90° |
γ | 90° |
Cell volume | 1287.3 ± 0.4 Å3 |
Cell temperature | 100 K |
Ambient diffraction temperature | 100 K |
Number of distinct elements | 6 |
Space group number | 19 |
Hermann-Mauguin space group symbol | P 21 21 21 |
Hall space group symbol | P 2ac 2ab |
Residual factor for all reflections | 0.0383 |
Residual factor for significantly intense reflections | 0.0334 |
Weighted residual factors for significantly intense reflections | 0.0836 |
Weighted residual factors for all reflections included in the refinement | 0.0858 |
Goodness-of-fit parameter for all reflections included in the refinement | 1.015 |
Diffraction radiation wavelength | 0.71073 Å |
Diffraction radiation type | MoKα |