Information card for entry 7246884
Formula | C14 H18 Co N2 O5 |
Calculated formula | C14 H18 Co N2 O5 |
Title of publication | Water coordinated Co-MOFs with 1D/2D network structure and highly enhanced electrocatalytic OER activity |
Authors of publication | Muthukumar, Pandi; Arunkumar, Gunasekaran; Pannipara, Mehboobali; Al-Sehemi, Abdullah G.; Moon, Dohyun; Anthony, Savarimuthu Philip |
Journal of publication | CrystEngComm |
Year of publication | 2023 |
Journal volume | 25 |
Journal issue | 28 |
Pages of publication | 4058 - 4063 |
a | 10.812 ± 0.002 Å |
b | 18.958 ± 0.004 Å |
c | 7.114 ± 0.0014 Å |
α | 90° |
β | 116.03 ± 0.03° |
γ | 90° |
Cell volume | 1310.3 ± 0.6 Å3 |
Cell temperature | 220 ± 2 K |
Ambient diffraction temperature | 220 ± 2 K |
Number of distinct elements | 5 |
Space group number | 15 |
Hermann-Mauguin space group symbol | C 1 2/c 1 |
Hall space group symbol | -C 2yc |
Residual factor for all reflections | 0.0518 |
Residual factor for significantly intense reflections | 0.0506 |
Weighted residual factors for significantly intense reflections | 0.1546 |
Weighted residual factors for all reflections included in the refinement | 0.1556 |
Goodness-of-fit parameter for all reflections included in the refinement | 1.188 |
Diffraction radiation wavelength | 0.63 Å |
Diffraction radiation type | synchrotron |