Information card for entry 7246885
Formula | C18 H14 Co N2 O5 |
Calculated formula | C18 H14 Co N2 O5 |
Title of publication | Water coordinated Co-MOFs with 1D/2D network structure and highly enhanced electrocatalytic OER activity |
Authors of publication | Muthukumar, Pandi; Arunkumar, Gunasekaran; Pannipara, Mehboobali; Al-Sehemi, Abdullah G.; Moon, Dohyun; Anthony, Savarimuthu Philip |
Journal of publication | CrystEngComm |
Year of publication | 2023 |
Journal volume | 25 |
Journal issue | 28 |
Pages of publication | 4058 - 4063 |
a | 9.655 ± 0.0019 Å |
b | 16.355 ± 0.003 Å |
c | 11.069 ± 0.002 Å |
α | 90° |
β | 110.97 ± 0.03° |
γ | 90° |
Cell volume | 1632.1 ± 0.6 Å3 |
Cell temperature | 220 ± 2 K |
Ambient diffraction temperature | 220 ± 2 K |
Number of distinct elements | 5 |
Space group number | 14 |
Hermann-Mauguin space group symbol | P 1 21/n 1 |
Hall space group symbol | -P 2yn |
Residual factor for all reflections | 0.0529 |
Residual factor for significantly intense reflections | 0.0491 |
Weighted residual factors for significantly intense reflections | 0.1533 |
Weighted residual factors for all reflections included in the refinement | 0.1563 |
Goodness-of-fit parameter for all reflections included in the refinement | 1.191 |
Diffraction radiation wavelength | 0.63 Å |
Diffraction radiation type | synchrotron |