Information card for entry 7246887
Formula | C26 H28 Cl2 Co N4 |
Calculated formula | C26 H28 Cl2 Co N4 |
Title of publication | Synthesis, crystal structures and DFT studies of Co(ii) and Zn(ii) coordination polymers of terephthalate and 4,4′-trimethylenedipyridyl ligands for removal of dibenzothiophene from a model fuel oil |
Authors of publication | Tella, Adedibu C.; Owalude, Samson O.; Ameen, Olanrewaju A.; Clayton, Hadley S.; Yusuph, Quadrat; Dembaremba, Tendai O.; Hosten, Eric C.; Ogunlaja, Adeniyi S. |
Journal of publication | CrystEngComm |
Year of publication | 2023 |
Journal volume | 25 |
Journal issue | 28 |
Pages of publication | 3998 - 4010 |
a | 17.0985 ± 0.0006 Å |
b | 17.0985 ± 0.0006 Å |
c | 42.1074 ± 0.0017 Å |
α | 90° |
β | 90° |
γ | 90° |
Cell volume | 12310.5 ± 0.8 Å3 |
Cell temperature | 200 ± 2 K |
Ambient diffraction temperature | 200 ± 2 K |
Number of distinct elements | 5 |
Space group number | 88 |
Hermann-Mauguin space group symbol | I 41/a :2 |
Hall space group symbol | -I 4ad |
Residual factor for all reflections | 0.0979 |
Residual factor for significantly intense reflections | 0.0725 |
Weighted residual factors for significantly intense reflections | 0.2139 |
Weighted residual factors for all reflections included in the refinement | 0.2397 |
Goodness-of-fit parameter for all reflections included in the refinement | 1.061 |
Diffraction radiation wavelength | 0.71073 Å |
Diffraction radiation type | MoKα |