Information card for entry 7246888
Formula | C42 H42 N4 O11 Zn2 |
Calculated formula | C42 H42 N4 O11 Zn2 |
Title of publication | Synthesis, crystal structures and DFT studies of Co(ii) and Zn(ii) coordination polymers of terephthalate and 4,4′-trimethylenedipyridyl ligands for removal of dibenzothiophene from a model fuel oil |
Authors of publication | Tella, Adedibu C.; Owalude, Samson O.; Ameen, Olanrewaju A.; Clayton, Hadley S.; Yusuph, Quadrat; Dembaremba, Tendai O.; Hosten, Eric C.; Ogunlaja, Adeniyi S. |
Journal of publication | CrystEngComm |
Year of publication | 2023 |
Journal volume | 25 |
Journal issue | 28 |
Pages of publication | 3998 - 4010 |
a | 21.0837 ± 0.0009 Å |
b | 11.4677 ± 0.0005 Å |
c | 19.6425 ± 0.0013 Å |
α | 90° |
β | 119.297 ± 0.002° |
γ | 90° |
Cell volume | 4141.7 ± 0.4 Å3 |
Cell temperature | 200 ± 2 K |
Ambient diffraction temperature | 200 ± 2 K |
Number of distinct elements | 5 |
Space group number | 15 |
Hermann-Mauguin space group symbol | C 1 2/c 1 |
Hall space group symbol | -C 2yc |
Residual factor for all reflections | 0.0445 |
Residual factor for significantly intense reflections | 0.0382 |
Weighted residual factors for significantly intense reflections | 0.0962 |
Weighted residual factors for all reflections included in the refinement | 0.1002 |
Goodness-of-fit parameter for all reflections included in the refinement | 1.06 |
Diffraction radiation wavelength | 0.71073 Å |
Diffraction radiation type | MoKα |