Information card for entry 7246890
Formula | C24 H40 Mn3 Mo12 N8 O66 P8 |
Calculated formula | C24 H40 Mn3 Mo12 N8 O66 P8 |
Title of publication | Two new manganese-based phosphomolybdate compounds as electrochemical sensors for the highly sensitive trace determination of heavy metal Cr(vi) ions |
Authors of publication | Wang, Jinling; Liu, Xiaohui; Chang, Zhihan; Xu, Na; Wang, Xiuli |
Journal of publication | CrystEngComm |
Year of publication | 2023 |
Journal volume | 25 |
Journal issue | 27 |
Pages of publication | 3953 - 3958 |
a | 12.0309 ± 0.0008 Å |
b | 13.9974 ± 0.0009 Å |
c | 14.7291 ± 0.0009 Å |
α | 103.276 ± 0.001° |
β | 106.729 ± 0.001° |
γ | 110.009 ± 0.001° |
Cell volume | 2078.4 ± 0.2 Å3 |
Cell temperature | 273.15 K |
Ambient diffraction temperature | 273.15 K |
Number of distinct elements | 7 |
Space group number | 2 |
Hermann-Mauguin space group symbol | P -1 |
Hall space group symbol | -P 1 |
Residual factor for all reflections | 0.0444 |
Residual factor for significantly intense reflections | 0.0411 |
Weighted residual factors for significantly intense reflections | 0.1139 |
Weighted residual factors for all reflections included in the refinement | 0.1163 |
Goodness-of-fit parameter for all reflections included in the refinement | 1.074 |
Diffraction radiation probe | x-ray |
Diffraction radiation wavelength | 0.71073 Å |
Diffraction radiation type | MoKα |
Diffraction radiation X-ray symbol | K-L~3~ |