Information card for entry 7246891
Formula | C24 H34 Mn3 Mo12 N8 O66 P8 |
Calculated formula | C24 H40 Mn3 Mo12 N8 O66 P8 |
Title of publication | Two new manganese-based phosphomolybdate compounds as electrochemical sensors for the highly sensitive trace determination of heavy metal Cr(vi) ions |
Authors of publication | Wang, Jinling; Liu, Xiaohui; Chang, Zhihan; Xu, Na; Wang, Xiuli |
Journal of publication | CrystEngComm |
Year of publication | 2023 |
Journal volume | 25 |
Journal issue | 27 |
Pages of publication | 3953 - 3958 |
a | 11.944 ± 0.0003 Å |
b | 13.794 ± 0.0004 Å |
c | 14.6825 ± 0.0004 Å |
α | 102.637 ± 0.001° |
β | 106° |
γ | 110.82° |
Cell volume | 2033.94 ± 0.1 Å3 |
Cell temperature | 296.15 K |
Ambient diffraction temperature | 296.15 K |
Number of distinct elements | 7 |
Space group number | 2 |
Hermann-Mauguin space group symbol | P -1 |
Hall space group symbol | -P 1 |
Residual factor for all reflections | 0.0397 |
Residual factor for significantly intense reflections | 0.0354 |
Weighted residual factors for significantly intense reflections | 0.1025 |
Weighted residual factors for all reflections included in the refinement | 0.1061 |
Goodness-of-fit parameter for all reflections included in the refinement | 1.033 |
Diffraction radiation probe | x-ray |
Diffraction radiation wavelength | 0.71073 Å |
Diffraction radiation type | MoKα |
Diffraction radiation X-ray symbol | K-L~3~ |