Information card for entry 7246922
Formula | C18 H17 Ag Cl3 N3 O4 S2 |
Calculated formula | C18 H17 Ag Cl3 N3 O4 S2 |
Title of publication | Preparation of one-dimensional coordination polymers of a flexible tripyridyl disulfide with diverse topologies |
Authors of publication | Lee, Hyeong-Hwan; Oh, Jihye; Lee, Shim Sung; Park, In-Hyeok |
Journal of publication | CrystEngComm |
Year of publication | 2023 |
Journal volume | 25 |
Journal issue | 28 |
Pages of publication | 4033 - 4038 |
a | 9.8728 ± 0.0008 Å |
b | 10.2889 ± 0.0009 Å |
c | 10.9536 ± 0.0009 Å |
α | 80.721 ± 0.005° |
β | 87.251 ± 0.005° |
γ | 73.377 ± 0.004° |
Cell volume | 1052.22 ± 0.15 Å3 |
Cell temperature | 173 ± 2 K |
Ambient diffraction temperature | 173 ± 2 K |
Number of distinct elements | 7 |
Space group number | 2 |
Hermann-Mauguin space group symbol | P -1 |
Hall space group symbol | -P 1 |
Residual factor for all reflections | 0.1505 |
Residual factor for significantly intense reflections | 0.1429 |
Weighted residual factors for significantly intense reflections | 0.4537 |
Weighted residual factors for all reflections included in the refinement | 0.4768 |
Goodness-of-fit parameter for all reflections included in the refinement | 1.009 |
Diffraction radiation wavelength | 0.71073 Å |
Diffraction radiation type | MoKα |