Information card for entry 7246923
Chemical name | monoclinic |
Formula | C40 H43 N3 O7 Zn |
Calculated formula | C40 H43 N3 O7 Zn |
Title of publication | Modulating the luminescent performances on blue-emitting coordination polymers via tuning the end-solvent molecules |
Authors of publication | Hu, Hui; Zhang, Zhen-Wei; Zhang, Da-Shuai; Zhou, Xue; Ji, Hui; Zhang, Yong-Zheng; Deng, Yuchen; Geng, Longlong; Zhang, Xiuling; Lv, Chao; Wei, Rongmin; Wang, Jin-Hua |
Journal of publication | CrystEngComm |
Year of publication | 2023 |
Journal volume | 25 |
Journal issue | 27 |
Pages of publication | 3896 - 3903 |
a | 13.2718 ± 0.0001 Å |
b | 9.2515 ± 0.0001 Å |
c | 27.958 ± 0.0002 Å |
α | 90° |
β | 90.371 ± 0.001° |
γ | 90° |
Cell volume | 3432.72 ± 0.05 Å3 |
Cell temperature | 293 ± 2 K |
Ambient diffraction temperature | 293 ± 2 K |
Number of distinct elements | 5 |
Space group number | 9 |
Hermann-Mauguin space group symbol | C 1 c 1 |
Hall space group symbol | C -2yc |
Residual factor for all reflections | 0.0295 |
Residual factor for significantly intense reflections | 0.0294 |
Weighted residual factors for significantly intense reflections | 0.0793 |
Weighted residual factors for all reflections included in the refinement | 0.0793 |
Goodness-of-fit parameter for all reflections included in the refinement | 1.063 |
Diffraction radiation probe | x-ray |
Diffraction radiation wavelength | 1.54178 Å |
Diffraction radiation type | CuKα |