Information card for entry 7246925
Formula | C38 H36 N2 O6 Zn |
Calculated formula | C38 H36 N2 O6 Zn |
Title of publication | Modulating the luminescent performances on blue-emitting coordination polymers via tuning the end-solvent molecules |
Authors of publication | Hu, Hui; Zhang, Zhen-Wei; Zhang, Da-Shuai; Zhou, Xue; Ji, Hui; Zhang, Yong-Zheng; Deng, Yuchen; Geng, Longlong; Zhang, Xiuling; Lv, Chao; Wei, Rongmin; Wang, Jin-Hua |
Journal of publication | CrystEngComm |
Year of publication | 2023 |
Journal volume | 25 |
Journal issue | 27 |
Pages of publication | 3896 - 3903 |
a | 16.874 ± 0.003 Å |
b | 6.9253 ± 0.0011 Å |
c | 28.607 ± 0.005 Å |
α | 90° |
β | 91.96 ± 0.01° |
γ | 90° |
Cell volume | 3341 ± 1 Å3 |
Cell temperature | 293 ± 2 K |
Ambient diffraction temperature | 293.15 K |
Number of distinct elements | 5 |
Space group number | 15 |
Hermann-Mauguin space group symbol | C 1 2/c 1 |
Hall space group symbol | -C 2yc |
Residual factor for all reflections | 0.0716 |
Residual factor for significantly intense reflections | 0.0609 |
Weighted residual factors for significantly intense reflections | 0.1728 |
Weighted residual factors for all reflections included in the refinement | 0.1815 |
Goodness-of-fit parameter for all reflections included in the refinement | 1.109 |
Diffraction radiation wavelength | 0.71073 Å |
Diffraction radiation type | MoKα |