Information card for entry 7246924
Chemical name | monoclinic |
Formula | C34 H30 N2 O6 Zn |
Calculated formula | C34 H30 N2 O6 Zn |
Title of publication | Modulating the luminescent performances on blue-emitting coordination polymers via tuning the end-solvent molecules |
Authors of publication | Hu, Hui; Zhang, Zhen-Wei; Zhang, Da-Shuai; Zhou, Xue; Ji, Hui; Zhang, Yong-Zheng; Deng, Yuchen; Geng, Longlong; Zhang, Xiuling; Lv, Chao; Wei, Rongmin; Wang, Jin-Hua |
Journal of publication | CrystEngComm |
Year of publication | 2023 |
Journal volume | 25 |
Journal issue | 27 |
Pages of publication | 3896 - 3903 |
a | 17.1162 ± 0.001 Å |
b | 6.8868 ± 0.0004 Å |
c | 25.8217 ± 0.0015 Å |
α | 90° |
β | 98.038 ± 0.002° |
γ | 90° |
Cell volume | 3013.9 ± 0.3 Å3 |
Cell temperature | 293 ± 2 K |
Ambient diffraction temperature | 293.15 K |
Number of distinct elements | 5 |
Space group number | 15 |
Hermann-Mauguin space group symbol | C 1 2/c 1 |
Hall space group symbol | -C 2yc |
Residual factor for all reflections | 0.045 |
Residual factor for significantly intense reflections | 0.0356 |
Weighted residual factors for significantly intense reflections | 0.0866 |
Weighted residual factors for all reflections included in the refinement | 0.0907 |
Goodness-of-fit parameter for all reflections included in the refinement | 1.087 |
Diffraction radiation wavelength | 0.71073 Å |
Diffraction radiation type | MoKα |