Information card for entry 7247025
Formula | C35 H24 Cd N6 O4 |
Calculated formula | C35 H24 Cd N6 O4 |
Title of publication | A highly thermal and pH-stable fluorescence sensor for rapid detection of Hg2+, Fe3+, and tetracycline in aqueous solutions |
Authors of publication | Sun, Xuancheng; Li, Chaoxiong; Meng, Xianggao; Wang, Dunjia; Zheng, Chunyang |
Journal of publication | CrystEngComm |
Year of publication | 2023 |
Journal volume | 25 |
Journal issue | 32 |
Pages of publication | 4531 - 4538 |
a | 20.8701 ± 0.0007 Å |
b | 20.0485 ± 0.0007 Å |
c | 15.1301 ± 0.0005 Å |
α | 90° |
β | 114.052 ± 0.001° |
γ | 90° |
Cell volume | 5781 ± 0.3 Å3 |
Cell temperature | 100 K |
Ambient diffraction temperature | 100 K |
Number of distinct elements | 5 |
Space group number | 15 |
Hermann-Mauguin space group symbol | C 1 2/c 1 |
Hall space group symbol | -C 2yc |
Residual factor for all reflections | 0.0392 |
Residual factor for significantly intense reflections | 0.0292 |
Weighted residual factors for significantly intense reflections | 0.0754 |
Weighted residual factors for all reflections included in the refinement | 0.079 |
Goodness-of-fit parameter for all reflections included in the refinement | 1.078 |
Diffraction radiation probe | x-ray |
Diffraction radiation wavelength | 1.34139 Å |
Diffraction radiation type | Synchrotron |
Diffraction radiation X-ray symbol | GaKα |