Information card for entry 7247026
Common name |
Cesium iron selenide (0.82/1.62/2) |
Formula |
Cs0.82 Fe1.62 Se2 |
Calculated formula |
Cs0.82 Fe1.62 Se2 |
Title of publication |
Synthesis, structure and properties of coordination complexes of tin(ii) phthalocyanine and naphthalocyanine with transition metal fragments |
Authors of publication |
Faraonov, Maxim A.; Yudanova, Evgeniya I.; Kuzmin, Alexey V.; Khasanov, Salavat S.; Troyanov, Sergey I.; Otsuka, Akihiro; Yamochi, Hideki; Kitagawa, Hiroshi; Konarev, Dmitri V. |
Journal of publication |
CrystEngComm |
Year of publication |
2023 |
Journal volume |
25 |
Journal issue |
33 |
Pages of publication |
4620 - 4637 |
a |
3.9472 ± 0.0002 Å |
b |
3.9472 ± 0.0002 Å |
c |
15.2401 ± 0.0001 Å |
α |
90° |
β |
90° |
γ |
90° |
Cell volume |
237.447 ± 0.017 Å3 |
Ambient diffraction temperature |
30 K |
Number of distinct elements |
3 |
Space group number |
139 |
Hermann-Mauguin space group symbol |
I 4/m m m |
Hall space group symbol |
-I 4 2 |
Yes |
No |
No |