Information card for entry 7247029
Formula | C70 H72 Cl5 Ir N10 Na O6 Sn |
Calculated formula | C70 H72 Cl5 Ir N10 Na O6 Sn |
Title of publication | Synthesis, structure and properties of coordination complexes of tin(ii) phthalocyanine and naphthalocyanine with transition metal fragments |
Authors of publication | Faraonov, Maxim A.; Yudanova, Evgeniya I.; Kuzmin, Alexey V.; Khasanov, Salavat S.; Troyanov, Sergey I.; Otsuka, Akihiro; Yamochi, Hideki; Kitagawa, Hiroshi; Konarev, Dmitri V. |
Journal of publication | CrystEngComm |
Year of publication | 2023 |
Journal volume | 25 |
Journal issue | 33 |
Pages of publication | 4620 - 4637 |
a | 12.9659 ± 0.0004 Å |
b | 18.5545 ± 0.0003 Å |
c | 14.3959 ± 0.0003 Å |
α | 90° |
β | 104.36 ± 0.002° |
γ | 90° |
Cell volume | 3355.1 ± 0.14 Å3 |
Cell temperature | 120 ± 1 K |
Ambient diffraction temperature | 120 ± 1 K |
Number of distinct elements | 8 |
Space group number | 4 |
Hermann-Mauguin space group symbol | P 1 21 1 |
Hall space group symbol | P 2yb |
Residual factor for all reflections | 0.0281 |
Residual factor for significantly intense reflections | 0.0259 |
Weighted residual factors for significantly intense reflections | 0.0578 |
Weighted residual factors for all reflections included in the refinement | 0.0587 |
Goodness-of-fit parameter for all reflections included in the refinement | 1.035 |
Diffraction radiation probe | x-ray |
Diffraction radiation wavelength | 0.71073 Å |
Diffraction radiation type | MoKα |