Information card for entry 7247030
Formula | C46 H25 Cl2 N8 O3 Sn V |
Calculated formula | C45.9994 H24.9996 Cl1.9998 N8 O3 Sn V |
Title of publication | Synthesis, structure and properties of coordination complexes of tin(ii) phthalocyanine and naphthalocyanine with transition metal fragments |
Authors of publication | Faraonov, Maxim A.; Yudanova, Evgeniya I.; Kuzmin, Alexey V.; Khasanov, Salavat S.; Troyanov, Sergey I.; Otsuka, Akihiro; Yamochi, Hideki; Kitagawa, Hiroshi; Konarev, Dmitri V. |
Journal of publication | CrystEngComm |
Year of publication | 2023 |
Journal volume | 25 |
Journal issue | 33 |
Pages of publication | 4620 - 4637 |
a | 12.1076 ± 0.0003 Å |
b | 12.5476 ± 0.0003 Å |
c | 13.9976 ± 0.0003 Å |
α | 99.14 ± 0.002° |
β | 103.14 ± 0.002° |
γ | 109.704 ± 0.002° |
Cell volume | 1884.19 ± 0.09 Å3 |
Cell temperature | 130 ± 1 K |
Ambient diffraction temperature | 130 ± 1 K |
Number of distinct elements | 7 |
Space group number | 2 |
Hermann-Mauguin space group symbol | P -1 |
Hall space group symbol | -P 1 |
Residual factor for all reflections | 0.0203 |
Residual factor for significantly intense reflections | 0.0184 |
Weighted residual factors for significantly intense reflections | 0.0482 |
Weighted residual factors for all reflections included in the refinement | 0.0492 |
Goodness-of-fit parameter for all reflections included in the refinement | 1.059 |
Diffraction radiation probe | x-ray |
Diffraction radiation wavelength | 0.71073 Å |
Diffraction radiation type | MoKα |