Information card for entry 7247032
Formula | C48 H35 Cl2 I2 Ir N8 Sn |
Calculated formula | C48 H35 Cl2 I2 Ir N8 Sn |
Title of publication | Synthesis, structure and properties of coordination complexes of tin(ii) phthalocyanine and naphthalocyanine with transition metal fragments |
Authors of publication | Faraonov, Maxim A.; Yudanova, Evgeniya I.; Kuzmin, Alexey V.; Khasanov, Salavat S.; Troyanov, Sergey I.; Otsuka, Akihiro; Yamochi, Hideki; Kitagawa, Hiroshi; Konarev, Dmitri V. |
Journal of publication | CrystEngComm |
Year of publication | 2023 |
Journal volume | 25 |
Journal issue | 33 |
Pages of publication | 4620 - 4637 |
a | 14.8478 ± 0.0002 Å |
b | 12.6529 ± 0.0001 Å |
c | 23.7022 ± 0.0002 Å |
α | 90° |
β | 91.224 ± 0.001° |
γ | 90° |
Cell volume | 4451.86 ± 0.08 Å3 |
Cell temperature | 130 ± 2 K |
Ambient diffraction temperature | 130 ± 1 K |
Number of distinct elements | 7 |
Space group number | 14 |
Hermann-Mauguin space group symbol | P 1 21/n 1 |
Hall space group symbol | -P 2yn |
Residual factor for all reflections | 0.0229 |
Residual factor for significantly intense reflections | 0.0219 |
Weighted residual factors for significantly intense reflections | 0.0534 |
Weighted residual factors for all reflections included in the refinement | 0.0537 |
Goodness-of-fit parameter for all reflections included in the refinement | 1.118 |
Diffraction radiation probe | x-ray |
Diffraction radiation wavelength | 0.71073 Å |
Diffraction radiation type | MoKα |