Information card for entry 7247031
Formula | C101.5 H83 Cl5.5 N18 Na O6 Ru Sn2 |
Calculated formula | C101.5 H83 Cl5.5 N18 Na O6 Ru Sn2 |
Title of publication | Synthesis, structure and properties of coordination complexes of tin(ii) phthalocyanine and naphthalocyanine with transition metal fragments |
Authors of publication | Faraonov, Maxim A.; Yudanova, Evgeniya I.; Kuzmin, Alexey V.; Khasanov, Salavat S.; Troyanov, Sergey I.; Otsuka, Akihiro; Yamochi, Hideki; Kitagawa, Hiroshi; Konarev, Dmitri V. |
Journal of publication | CrystEngComm |
Year of publication | 2023 |
Journal volume | 25 |
Journal issue | 33 |
Pages of publication | 4620 - 4637 |
a | 36.653 ± 0.003 Å |
b | 21.7587 ± 0.0018 Å |
c | 28.04 ± 0.003 Å |
α | 90° |
β | 120.978 ± 0.002° |
γ | 90° |
Cell volume | 19173 ± 3 Å3 |
Cell temperature | 120 ± 1 K |
Ambient diffraction temperature | 120 ± 1 K |
Number of distinct elements | 8 |
Space group number | 15 |
Hermann-Mauguin space group symbol | C 1 2/c 1 |
Hall space group symbol | -C 2yc |
Residual factor for all reflections | 0.1728 |
Residual factor for significantly intense reflections | 0.1131 |
Weighted residual factors for significantly intense reflections | 0.2292 |
Weighted residual factors for all reflections included in the refinement | 0.2625 |
Goodness-of-fit parameter for all reflections included in the refinement | 1.149 |
Diffraction radiation probe | x-ray |
Diffraction radiation wavelength | 0.71073 Å |
Diffraction radiation type | MoKα |