Information card for entry 7247107
Formula | Al O5 P |
Calculated formula | Al O5 P |
Title of publication | A series of novel phosphites/phosphates with deep-ultraviolet cut-off edges from 0D polar to 3D non-polar architectures |
Authors of publication | Hao, Yucheng; Zhang, Yang; Zhang, Yuying; Fu, Zixiang; Heng, Chunyang; Li, Junjie; You, Jiatian; Hu, Kunhong; Lin, Yuan; Li, Haijian |
Journal of publication | CrystEngComm |
Year of publication | 2023 |
Journal volume | 25 |
Journal issue | 34 |
Pages of publication | 4864 - 4872 |
a | 6.8925 ± 0.0006 Å |
b | 7.1249 ± 0.0006 Å |
c | 8.6411 ± 0.0014 Å |
α | 89.34 ± 0.011° |
β | 67.136 ± 0.012° |
γ | 87.675 ± 0.007° |
Cell volume | 390.68 ± 0.09 Å3 |
Cell temperature | 293 ± 2 K |
Ambient diffraction temperature | 293 ± 2 K |
Number of distinct elements | 3 |
Space group number | 2 |
Hermann-Mauguin space group symbol | P -1 |
Hall space group symbol | -P 1 |
Residual factor for all reflections | 0.0963 |
Residual factor for significantly intense reflections | 0.0916 |
Weighted residual factors for significantly intense reflections | 0.205 |
Weighted residual factors for all reflections included in the refinement | 0.21 |
Goodness-of-fit parameter for all reflections included in the refinement | 1.116 |
Diffraction radiation wavelength | 0.71073 Å |
Diffraction radiation type | MoKα |