Information card for entry 7247108
Formula | Al3 O19.5 P6 |
Calculated formula | Al3 O19.5 P6 |
Title of publication | A series of novel phosphites/phosphates with deep-ultraviolet cut-off edges from 0D polar to 3D non-polar architectures |
Authors of publication | Hao, Yucheng; Zhang, Yang; Zhang, Yuying; Fu, Zixiang; Heng, Chunyang; Li, Junjie; You, Jiatian; Hu, Kunhong; Lin, Yuan; Li, Haijian |
Journal of publication | CrystEngComm |
Year of publication | 2023 |
Journal volume | 25 |
Journal issue | 34 |
Pages of publication | 4864 - 4872 |
a | 7.9101 ± 0.0007 Å |
b | 7.9101 ± 0.0007 Å |
c | 7.1057 ± 0.0008 Å |
α | 90° |
β | 90° |
γ | 120° |
Cell volume | 385.04 ± 0.06 Å3 |
Cell temperature | 293 ± 2 K |
Ambient diffraction temperature | 293 ± 2 K |
Number of distinct elements | 3 |
Space group number | 176 |
Hermann-Mauguin space group symbol | P 63/m |
Hall space group symbol | -P 6c |
Residual factor for all reflections | 0.0668 |
Residual factor for significantly intense reflections | 0.0603 |
Weighted residual factors for significantly intense reflections | 0.1706 |
Weighted residual factors for all reflections included in the refinement | 0.1749 |
Goodness-of-fit parameter for all reflections included in the refinement | 1.149 |
Diffraction radiation wavelength | 0.71073 Å |
Diffraction radiation type | MoKα |