Information card for entry 7247109
Formula | Ca O3 P |
Calculated formula | Ca O3 P |
Title of publication | A series of novel phosphites/phosphates with deep-ultraviolet cut-off edges from 0D polar to 3D non-polar architectures |
Authors of publication | Hao, Yucheng; Zhang, Yang; Zhang, Yuying; Fu, Zixiang; Heng, Chunyang; Li, Junjie; You, Jiatian; Hu, Kunhong; Lin, Yuan; Li, Haijian |
Journal of publication | CrystEngComm |
Year of publication | 2023 |
Journal volume | 25 |
Journal issue | 34 |
Pages of publication | 4864 - 4872 |
a | 6.692 ± 0.0002 Å |
b | 6.692 ± 0.0002 Å |
c | 13.0305 ± 0.0007 Å |
α | 90° |
β | 90° |
γ | 90° |
Cell volume | 583.54 ± 0.04 Å3 |
Cell temperature | 293 ± 2 K |
Ambient diffraction temperature | 293 ± 2 K |
Number of distinct elements | 3 |
Space group number | 96 |
Hermann-Mauguin space group symbol | P 43 21 2 |
Hall space group symbol | P 4nw 2abw |
Residual factor for all reflections | 0.0251 |
Residual factor for significantly intense reflections | 0.0243 |
Weighted residual factors for significantly intense reflections | 0.0654 |
Weighted residual factors for all reflections included in the refinement | 0.0659 |
Goodness-of-fit parameter for all reflections included in the refinement | 1.133 |
Diffraction radiation wavelength | 0.71073 Å |
Diffraction radiation type | MoKα |