Information card for entry 7247117
Chemical name | C74H76Cl4Fe4NO60 |
Formula | C74 H80 Cl4 Fe4 N O60 |
Calculated formula | C74 H80 Cl4 Fe4 N O60 |
Title of publication | Crystallographic and dielectric studies of tetrahedral {NH4@Fe4} crystallized with halomethane molecules |
Authors of publication | Matsumoto, Daiki; Tanaka, Chiaki; Fujibayashi, Masaru; Nishihara, Sadafumi; Takahashi, Kiyonori; Nakamura, Takayoshi; Akutagawa, Tomoyuki; Masuya-Suzuki, Atsuko; Tsunashima, Ryo |
Journal of publication | CrystEngComm |
Year of publication | 2023 |
Journal volume | 25 |
Journal issue | 34 |
Pages of publication | 4793 - 4797 |
a | 27.2657 ± 0.0008 Å |
b | 17.98779 ± 0.00019 Å |
c | 15.0294 ± 0.0004 Å |
α | 90° |
β | 133.512 ± 0.005° |
γ | 90° |
Cell volume | 5345.8 ± 0.5 Å3 |
Cell temperature | 223.15 K |
Ambient diffraction temperature | 223.15 K |
Number of distinct elements | 6 |
Space group number | 5 |
Hermann-Mauguin space group symbol | C 1 2 1 |
Hall space group symbol | C 2y |
Residual factor for all reflections | 0.0539 |
Residual factor for significantly intense reflections | 0.0531 |
Weighted residual factors for significantly intense reflections | 0.1383 |
Weighted residual factors for all reflections included in the refinement | 0.1392 |
Goodness-of-fit parameter for all reflections included in the refinement | 1.026 |
Diffraction radiation wavelength | 1.54184 Å |
Diffraction radiation type | CuKα |