Information card for entry 7247118
Chemical name | [NH4<C72H72O60Fe4](CH2Br2)2 |
Formula | C74 H80 Br4 Fe4 N O60 |
Calculated formula | C74 H80 Br4 Fe4 N O60 |
Title of publication | Crystallographic and dielectric studies of tetrahedral {NH4@Fe4} crystallized with halomethane molecules |
Authors of publication | Matsumoto, Daiki; Tanaka, Chiaki; Fujibayashi, Masaru; Nishihara, Sadafumi; Takahashi, Kiyonori; Nakamura, Takayoshi; Akutagawa, Tomoyuki; Masuya-Suzuki, Atsuko; Tsunashima, Ryo |
Journal of publication | CrystEngComm |
Year of publication | 2023 |
Journal volume | 25 |
Journal issue | 34 |
Pages of publication | 4793 - 4797 |
a | 27.2902 ± 0.0013 Å |
b | 17.9198 ± 0.0003 Å |
c | 15.0346 ± 0.0007 Å |
α | 90° |
β | 133.441 ± 0.009° |
γ | 90° |
Cell volume | 5338.5 ± 0.9 Å3 |
Cell temperature | 223 ± 0.1 K |
Ambient diffraction temperature | 223 ± 0.1 K |
Number of distinct elements | 6 |
Space group number | 5 |
Hermann-Mauguin space group symbol | C 1 2 1 |
Hall space group symbol | C 2y |
Residual factor for all reflections | 0.0745 |
Residual factor for significantly intense reflections | 0.0709 |
Weighted residual factors for significantly intense reflections | 0.2038 |
Weighted residual factors for all reflections included in the refinement | 0.2077 |
Goodness-of-fit parameter for all reflections included in the refinement | 1.061 |
Diffraction radiation probe | x-ray |
Diffraction radiation wavelength | 0.71073 Å |
Diffraction radiation type | MoKα |