Information card for entry 7247164
Common name | 4-fluorobenzoate-tin-tetraiodoporphrin |
Formula | C64 H44 F2 I4 N4 O4 Sn |
Calculated formula | C64 H44 F2 I4 N4 O4 Sn |
Title of publication | Homo- and hetero-halogen interaction based molecular associations in wheel–axle topology derived Sn(iv) porphyrin complexes: an experimental and theoretical analysis |
Authors of publication | Siddiqui, Rafia; Rani, Jyoti; Akshita,; Dhamija, Swati; Shivam, Kumar; Kagra, Deepika; Sharma, Purshotam; Venugopalan, P.; Patra, Ranjan |
Journal of publication | CrystEngComm |
Year of publication | 2023 |
Journal volume | 25 |
Journal issue | 35 |
Pages of publication | 4946 - 4959 |
a | 14.2789 ± 0.0003 Å |
b | 16.8821 ± 0.0004 Å |
c | 12.1517 ± 0.0003 Å |
α | 90° |
β | 96.37 ± 0.002° |
γ | 90° |
Cell volume | 2911.18 ± 0.12 Å3 |
Cell temperature | 293 ± 2 K |
Ambient diffraction temperature | 293 ± 2 K |
Number of distinct elements | 7 |
Space group number | 14 |
Hermann-Mauguin space group symbol | P 1 21/c 1 |
Hall space group symbol | -P 2ybc |
Residual factor for all reflections | 0.0559 |
Residual factor for significantly intense reflections | 0.045 |
Weighted residual factors for significantly intense reflections | 0.1334 |
Weighted residual factors for all reflections included in the refinement | 0.139 |
Goodness-of-fit parameter for all reflections included in the refinement | 1.059 |
Diffraction radiation wavelength | 0.71073 Å |
Diffraction radiation type | MoKα |