Information card for entry 7247165
Common name | 2,4,6-trifluorobenzoate-tin-tetraiodoporphrin |
Formula | C64 H40 F6 I4 N4 O4 Sn |
Calculated formula | C64 H40 F6 I4 N4 O4 Sn |
Title of publication | Homo- and hetero-halogen interaction based molecular associations in wheel–axle topology derived Sn(iv) porphyrin complexes: an experimental and theoretical analysis |
Authors of publication | Siddiqui, Rafia; Rani, Jyoti; Akshita,; Dhamija, Swati; Shivam, Kumar; Kagra, Deepika; Sharma, Purshotam; Venugopalan, P.; Patra, Ranjan |
Journal of publication | CrystEngComm |
Year of publication | 2023 |
Journal volume | 25 |
Journal issue | 35 |
Pages of publication | 4946 - 4959 |
a | 21.2268 ± 0.0007 Å |
b | 15.2917 ± 0.0005 Å |
c | 18.6929 ± 0.0005 Å |
α | 90° |
β | 94.748 ± 0.003° |
γ | 90° |
Cell volume | 6046.8 ± 0.3 Å3 |
Cell temperature | 293 ± 2 K |
Ambient diffraction temperature | 293 ± 2 K |
Number of distinct elements | 7 |
Space group number | 15 |
Hermann-Mauguin space group symbol | C 1 2/c 1 |
Hall space group symbol | -C 2yc |
Residual factor for all reflections | 0.0655 |
Residual factor for significantly intense reflections | 0.0542 |
Weighted residual factors for significantly intense reflections | 0.1614 |
Weighted residual factors for all reflections included in the refinement | 0.1709 |
Goodness-of-fit parameter for all reflections included in the refinement | 1.073 |
Diffraction radiation wavelength | 0.71073 Å |
Diffraction radiation type | MoKα |