Information card for entry 7247169
Common name | 2,3,4,5-tetrafluorobenzoate-tin-tetraiodoporphrin |
Formula | C58 H26 F8 I4 N4 O4 Sn |
Calculated formula | C58 H26 F8 I4 N4 O4 Sn |
Title of publication | Homo- and hetero-halogen interaction based molecular associations in wheel–axle topology derived Sn(iv) porphyrin complexes: an experimental and theoretical analysis |
Authors of publication | Siddiqui, Rafia; Rani, Jyoti; Akshita,; Dhamija, Swati; Shivam, Kumar; Kagra, Deepika; Sharma, Purshotam; Venugopalan, P.; Patra, Ranjan |
Journal of publication | CrystEngComm |
Year of publication | 2023 |
Journal volume | 25 |
Journal issue | 35 |
Pages of publication | 4946 - 4959 |
a | 10.6659 ± 0.0001 Å |
b | 24.8734 ± 0.0004 Å |
c | 30.8319 ± 0.0004 Å |
α | 90° |
β | 92.536 ± 0.001° |
γ | 90° |
Cell volume | 8171.61 ± 0.19 Å3 |
Cell temperature | 293 ± 2 K |
Ambient diffraction temperature | 293 ± 2 K |
Number of distinct elements | 7 |
Space group number | 14 |
Hermann-Mauguin space group symbol | P 1 21/c 1 |
Hall space group symbol | -P 2ybc |
Residual factor for all reflections | 0.0844 |
Residual factor for significantly intense reflections | 0.0648 |
Weighted residual factors for significantly intense reflections | 0.2008 |
Weighted residual factors for all reflections included in the refinement | 0.2147 |
Goodness-of-fit parameter for all reflections included in the refinement | 1.078 |
Diffraction radiation wavelength | 0.71073 Å |
Diffraction radiation type | MoKα |