Information card for entry 7247170
Formula | C26 H22 N20 O2 Pb3 |
Calculated formula | C26 H22 N20 O2 Pb3 |
Title of publication | Tetrel bonding stabilization of a new coordination polymer constructed from lead(ii) azide and 1-(pyridin-2-yl)ethylidenepicolinohydrazide |
Authors of publication | Mahmoudi, Ghodrat; Zangrando, Ennio; Gurbanov, Atash V.; Eftekhari-Sis, Bagher; Mitoraj, Mariusz P.; Sagan, Filip; Safin, Damir A. |
Journal of publication | CrystEngComm |
Year of publication | 2023 |
Journal volume | 25 |
Journal issue | 36 |
Pages of publication | 5100 - 5108 |
a | 11.1507 ± 0.0006 Å |
b | 11.742 ± 0.0006 Å |
c | 14.0683 ± 0.0007 Å |
α | 73.932 ± 0.005° |
β | 85.67 ± 0.004° |
γ | 84.591 ± 0.004° |
Cell volume | 1759.79 ± 0.16 Å3 |
Cell temperature | 293 ± 2 K |
Ambient diffraction temperature | 293 ± 2 K |
Number of distinct elements | 5 |
Space group number | 2 |
Hermann-Mauguin space group symbol | P -1 |
Hall space group symbol | -P 1 |
Residual factor for all reflections | 0.0927 |
Residual factor for significantly intense reflections | 0.0629 |
Weighted residual factors for significantly intense reflections | 0.1359 |
Weighted residual factors for all reflections included in the refinement | 0.1498 |
Goodness-of-fit parameter for all reflections included in the refinement | 1.086 |
Diffraction radiation wavelength | 0.71073 Å |
Diffraction radiation type | MoKα |