Information card for entry 7247188
Chemical name | xstr1407 |
Formula | C173.5 H146.25 Cd7 N19.25 O46 |
Calculated formula | C173.5 H146.25 Cd7 N19.25 O46 |
Title of publication | Encapsulation of N-containing compounds in a new hydrophilic Cd-based crystalline sponge via coordinative alignment method |
Authors of publication | Habib, Faiza; Tocher, Derek A.; Carmalt, Claire J. |
Journal of publication | CrystEngComm |
Year of publication | 2023 |
Journal volume | 25 |
Journal issue | 35 |
Pages of publication | 5001 - 5011 |
a | 14.1427 ± 0.0003 Å |
b | 43.199 ± 0.0006 Å |
c | 33.7991 ± 0.0004 Å |
α | 90° |
β | 94.7053 ± 0.0016° |
γ | 90° |
Cell volume | 20580 ± 0.6 Å3 |
Cell temperature | 158 ± 11 K |
Ambient diffraction temperature | 158 ± 11 K |
Number of distinct elements | 5 |
Space group number | 14 |
Hermann-Mauguin space group symbol | P 1 21/n 1 |
Hall space group symbol | -P 2yn |
Residual factor for all reflections | 0.1102 |
Residual factor for significantly intense reflections | 0.0886 |
Weighted residual factors for significantly intense reflections | 0.2398 |
Weighted residual factors for all reflections included in the refinement | 0.2594 |
Goodness-of-fit parameter for all reflections included in the refinement | 1.034 |
Diffraction radiation probe | x-ray |
Diffraction radiation wavelength | 1.54184 Å |
Diffraction radiation type | CuKα |