Information card for entry 7247189
Chemical name | catena- [tetrakis(μ6-4,4?4??-[1,3,5-benzenetriyltris(carbonylimino)]-trisbenzoateo)-bis(μ3-oxo)-tri(dimethlyformamide)-pentaaqua-hepta cadmium acetone |
Formula | C117.39 H103.38 Cd5.6 N14.2 O39.66 |
Calculated formula | C117.392 H103.384 Cd5.6 N14.2 O39.656 |
Title of publication | Encapsulation of N-containing compounds in a new hydrophilic Cd-based crystalline sponge via coordinative alignment method |
Authors of publication | Habib, Faiza; Tocher, Derek A.; Carmalt, Claire J. |
Journal of publication | CrystEngComm |
Year of publication | 2023 |
Journal volume | 25 |
Journal issue | 35 |
Pages of publication | 5001 - 5011 |
a | 13.9475 ± 0.0002 Å |
b | 43.3134 ± 0.0004 Å |
c | 33.5321 ± 0.0004 Å |
α | 90° |
β | 94.4569 ± 0.0011° |
γ | 90° |
Cell volume | 20195.9 ± 0.4 Å3 |
Cell temperature | 151 ± 1 K |
Ambient diffraction temperature | 151 ± 1 K |
Number of distinct elements | 5 |
Space group number | 14 |
Hermann-Mauguin space group symbol | P 1 21/n 1 |
Hall space group symbol | -P 2yn |
Residual factor for all reflections | 0.1078 |
Residual factor for significantly intense reflections | 0.084 |
Weighted residual factors for significantly intense reflections | 0.22 |
Weighted residual factors for all reflections included in the refinement | 0.2454 |
Goodness-of-fit parameter for all reflections included in the refinement | 1.031 |
Diffraction radiation probe | x-ray |
Diffraction radiation wavelength | 1.54184 Å |
Diffraction radiation type | CuKα |