Information card for entry 7247206
Formula | C18 H8 F4 I2 O2 |
Calculated formula | C18 H8 F4 I2 O2 |
Title of publication | Halogen bonded supramolecular assemblies constructed from azulene derivatives and perfluorinated di-/triiodobenzenes |
Authors of publication | Dogaru, Andreea; Apostol, Adrian A.; Maxim, Catalin; Raduca, Mihai; Novikov, Alexander S.; Nicolescu, Alina; Deleanu, Calin; Nica, Simona; Andruh, Marius |
Journal of publication | CrystEngComm |
Year of publication | 2023 |
Journal volume | 25 |
Journal issue | 37 |
Pages of publication | 5243 - 5261 |
a | 4.1607 ± 0.0002 Å |
b | 14.3681 ± 0.0005 Å |
c | 16.2365 ± 0.0005 Å |
α | 70.813 ± 0.003° |
β | 88.318 ± 0.003° |
γ | 83.695 ± 0.003° |
Cell volume | 911.15 ± 0.06 Å3 |
Cell temperature | 293 ± 2 K |
Ambient diffraction temperature | 293 ± 2 K |
Number of distinct elements | 5 |
Space group number | 2 |
Hermann-Mauguin space group symbol | P -1 |
Hall space group symbol | -P 1 |
Residual factor for all reflections | 0.0317 |
Residual factor for significantly intense reflections | 0.0261 |
Weighted residual factors for significantly intense reflections | 0.0611 |
Weighted residual factors for all reflections included in the refinement | 0.0637 |
Goodness-of-fit parameter for all reflections included in the refinement | 1.076 |
Diffraction radiation wavelength | 0.71073 Å |
Diffraction radiation type | MoKα |