Information card for entry 7247207
Formula | C26 H14 F4 I2 N2 |
Calculated formula | C26 H14 F4 I2 N2 |
Title of publication | Halogen bonded supramolecular assemblies constructed from azulene derivatives and perfluorinated di-/triiodobenzenes |
Authors of publication | Dogaru, Andreea; Apostol, Adrian A.; Maxim, Catalin; Raduca, Mihai; Novikov, Alexander S.; Nicolescu, Alina; Deleanu, Calin; Nica, Simona; Andruh, Marius |
Journal of publication | CrystEngComm |
Year of publication | 2023 |
Journal volume | 25 |
Journal issue | 37 |
Pages of publication | 5243 - 5261 |
a | 29.444 ± 0.0008 Å |
b | 8.5268 ± 0.0002 Å |
c | 18.3966 ± 0.0005 Å |
α | 90° |
β | 91.377 ± 0.003° |
γ | 90° |
Cell volume | 4617.4 ± 0.2 Å3 |
Cell temperature | 293 ± 2 K |
Ambient diffraction temperature | 293 ± 2 K |
Number of distinct elements | 5 |
Space group number | 15 |
Hermann-Mauguin space group symbol | C 1 2/c 1 |
Hall space group symbol | -C 2yc |
Residual factor for all reflections | 0.0217 |
Residual factor for significantly intense reflections | 0.0189 |
Weighted residual factors for significantly intense reflections | 0.0469 |
Weighted residual factors for all reflections included in the refinement | 0.0479 |
Goodness-of-fit parameter for all reflections included in the refinement | 1.041 |
Diffraction radiation wavelength | 0.71073 Å |
Diffraction radiation type | MoKα |