Information card for entry 7247246
Formula | C16 H14 Cu N4 O6 |
Calculated formula | C16 H14 Cu N4 O6 |
Title of publication | Fabrication of two 2D Cu-based coordination polymers via a secondary ligand adjustment and a derived Cu/Cu2O heterojunction for an enhanced dye removal capacity |
Authors of publication | Li, Wen-Ze; Li, Jing; Zhao, Hong-Tian; Zhang, Xiao-Sa; Liu, Yu; Liu, Zhi-Tong; Fu, Hong-Xin; Luan, Jian |
Journal of publication | CrystEngComm |
Year of publication | 2023 |
Journal volume | 25 |
Journal issue | 37 |
Pages of publication | 5351 - 5361 |
a | 5.5038 ± 0.0003 Å |
b | 15.3084 ± 0.0009 Å |
c | 9.9468 ± 0.0006 Å |
α | 90° |
β | 92.58 ± 0.002° |
γ | 90° |
Cell volume | 837.21 ± 0.08 Å3 |
Cell temperature | 296 ± 2 K |
Ambient diffraction temperature | 296 ± 2 K |
Number of distinct elements | 5 |
Space group number | 14 |
Hermann-Mauguin space group symbol | P 1 21/c 1 |
Hall space group symbol | -P 2ybc |
Residual factor for all reflections | 0.0619 |
Residual factor for significantly intense reflections | 0.0398 |
Weighted residual factors for significantly intense reflections | 0.0736 |
Weighted residual factors for all reflections included in the refinement | 0.0806 |
Goodness-of-fit parameter for all reflections included in the refinement | 1.011 |
Diffraction radiation wavelength | 0.71073 Å |
Diffraction radiation type | MoKα |