Information card for entry 7247247
Formula | C20 H14 Cu N4 O6 |
Calculated formula | C20 H14 Cu N4 O6 |
Title of publication | Fabrication of two 2D Cu-based coordination polymers via a secondary ligand adjustment and a derived Cu/Cu2O heterojunction for an enhanced dye removal capacity |
Authors of publication | Li, Wen-Ze; Li, Jing; Zhao, Hong-Tian; Zhang, Xiao-Sa; Liu, Yu; Liu, Zhi-Tong; Fu, Hong-Xin; Luan, Jian |
Journal of publication | CrystEngComm |
Year of publication | 2023 |
Journal volume | 25 |
Journal issue | 37 |
Pages of publication | 5351 - 5361 |
a | 9.791 ± 0.0015 Å |
b | 6.3116 ± 0.001 Å |
c | 28.379 ± 0.004 Å |
α | 90° |
β | 93.082 ± 0.004° |
γ | 90° |
Cell volume | 1751.2 ± 0.5 Å3 |
Cell temperature | 296 ± 2 K |
Ambient diffraction temperature | 296 ± 2 K |
Number of distinct elements | 5 |
Space group number | 14 |
Hermann-Mauguin space group symbol | P 1 21/c 1 |
Hall space group symbol | -P 2ybc |
Residual factor for all reflections | 0.1349 |
Residual factor for significantly intense reflections | 0.0608 |
Weighted residual factors for significantly intense reflections | 0.0992 |
Weighted residual factors for all reflections included in the refinement | 0.1214 |
Goodness-of-fit parameter for all reflections included in the refinement | 1 |
Diffraction radiation wavelength | 0.71073 Å |
Diffraction radiation type | MoKα |