Information card for entry 7247303
Formula | C29.2 H27.6 O14.6 Zn3 |
Calculated formula | C29.2 H27.6 O14.6 Zn3 |
Title of publication | Sensitive luminescent chemosensing of fluoride based on Eu-doped Zn-LMOF in aqueous media: structural and spectroscopic studies |
Authors of publication | Toledo-Jaldín, Helen Paola; Pinzón-Vanegas, Cristian; León-Gómez, Juan Pablo; Blanco Flores, Alien; Martínez-Otero, Diego; Reyes Domínguez, Iván A.; Canseco-González, Daniel; Rosales-Vázquez, Luis D.; Salomón-Flores, María K.; Dorazco-González, Alejandro |
Journal of publication | CrystEngComm |
Year of publication | 2023 |
Journal volume | 25 |
Journal issue | 26 |
Pages of publication | 3766 - 3776 |
a | 20.1166 ± 0.0014 Å |
b | 10.6178 ± 0.0007 Å |
c | 16.0756 ± 0.0011 Å |
α | 90° |
β | 108.39 ± 0.0012° |
γ | 90° |
Cell volume | 3258.3 ± 0.4 Å3 |
Cell temperature | 100 ± 2 K |
Ambient diffraction temperature | 100 ± 2 K |
Number of distinct elements | 4 |
Space group number | 15 |
Hermann-Mauguin space group symbol | C 1 2/c 1 |
Hall space group symbol | -C 2yc |
Residual factor for all reflections | 0.0488 |
Residual factor for significantly intense reflections | 0.0456 |
Weighted residual factors for significantly intense reflections | 0.123 |
Weighted residual factors for all reflections included in the refinement | 0.1257 |
Goodness-of-fit parameter for all reflections included in the refinement | 1.068 |
Diffraction radiation wavelength | 0.71073 Å |
Diffraction radiation type | MoKα |