Information card for entry 7247304
Formula | C34 H37 Co N4 O8.5 |
Calculated formula | C34 H34 Co N4 O8.5 |
Title of publication | Formation of entangled Co(ii) coordination polymers based on bis-pyridyl-bis-amide and angular dicarboxylate ligands: a structural comparison |
Authors of publication | Huang, Wei-Chun; Chen, Wei-Hao; Chen, Chia-Ling; Liao, Tsung-Te; Chen, Yi-Wun; Chen, Jhy-Der |
Journal of publication | CrystEngComm |
Year of publication | 2023 |
Journal volume | 25 |
Journal issue | 39 |
Pages of publication | 5575 - 5587 |
a | 15.3926 ± 0.0004 Å |
b | 54.654 ± 0.0013 Å |
c | 16.2237 ± 0.0004 Å |
α | 90° |
β | 90° |
γ | 90° |
Cell volume | 13648.5 ± 0.6 Å3 |
Cell temperature | 296 ± 2 K |
Ambient diffraction temperature | 296 ± 2 K |
Number of distinct elements | 5 |
Space group number | 68 |
Hermann-Mauguin space group symbol | C c c a :2 |
Hall space group symbol | -C 2a 2ac |
Residual factor for all reflections | 0.0903 |
Residual factor for significantly intense reflections | 0.0469 |
Weighted residual factors for significantly intense reflections | 0.1148 |
Weighted residual factors for all reflections included in the refinement | 0.1388 |
Goodness-of-fit parameter for all reflections included in the refinement | 1.009 |
Diffraction radiation wavelength | 0.71073 Å |
Diffraction radiation type | MoKα |