Information card for entry 7247317
Chemical name | 1,3,5-tris(4-bromo-phenoxymethyl)mesitylene |
Formula | C63 H60 Br6 O7 |
Calculated formula | C63 H60 Br6 O7 |
Title of publication | C–H hydrogen bond and halogen bond directed self-assembly of ethereal podands and C–X⋯F−/HF2− halogen bonding in solution |
Authors of publication | Dutta, Dipjyoti; Gogoi, Anamika; Dutta, Rupjyoti; Harmalkar, Sarvesh S.; Lama, Prem; Dey, Sandeep Kumar |
Journal of publication | CrystEngComm |
Year of publication | 2023 |
Journal volume | 25 |
Journal issue | 40 |
Pages of publication | 5650 - 5659 |
a | 9.4811 ± 0.0015 Å |
b | 12.591 ± 0.002 Å |
c | 13.809 ± 0.002 Å |
α | 107.591 ± 0.005° |
β | 95.204 ± 0.005° |
γ | 91.591 ± 0.005° |
Cell volume | 1562.3 ± 0.4 Å3 |
Cell temperature | 296 ± 2 K |
Ambient diffraction temperature | 296 ± 2 K |
Number of distinct elements | 4 |
Space group number | 2 |
Hermann-Mauguin space group symbol | P -1 |
Hall space group symbol | -P 1 |
Residual factor for all reflections | 0.1257 |
Residual factor for significantly intense reflections | 0.0839 |
Weighted residual factors for significantly intense reflections | 0.2442 |
Weighted residual factors for all reflections included in the refinement | 0.2816 |
Goodness-of-fit parameter for all reflections included in the refinement | 1.044 |
Diffraction radiation wavelength | 0.71073 Å |
Diffraction radiation type | MoKα |