Information card for entry 7247318
Formula | C15 H10 Eu N O9 |
Calculated formula | C15 H10 Eu N O9 |
Title of publication | Lanthanide-MOFs as multi-responsive photoluminescence sensor for sensitively detecting Fe3+, Cr2O72− and nitrofuran antibiotics |
Authors of publication | Feng, Jingjuan; Kong, Cunding; Chen, Yunhui; Cen, Peipei; Ding, Yi; Guo, Yan; Zhang, Fengyuan; Liu, Xiangyu |
Journal of publication | RSC Advances |
Year of publication | 2023 |
Journal volume | 13 |
Journal issue | 37 |
Pages of publication | 26196 - 26202 |
a | 11.4603 ± 0.0003 Å |
b | 13.9922 ± 0.0004 Å |
c | 11.4697 ± 0.0004 Å |
α | 90° |
β | 96.428 ± 0.003° |
γ | 90° |
Cell volume | 1827.66 ± 0.1 Å3 |
Cell temperature | 150.01 K |
Ambient diffraction temperature | 150.01 K |
Number of distinct elements | 5 |
Space group number | 14 |
Hermann-Mauguin space group symbol | P 1 21/c 1 |
Hall space group symbol | -P 2ybc |
Residual factor for all reflections | 0.0435 |
Residual factor for significantly intense reflections | 0.0341 |
Weighted residual factors for significantly intense reflections | 0.0812 |
Weighted residual factors for all reflections included in the refinement | 0.0858 |
Goodness-of-fit parameter for all reflections included in the refinement | 1.012 |
Diffraction radiation wavelength | 1.54184 Å |
Diffraction radiation type | CuKα |